Reaction Details
TargetAurora kinase A
LigandBDBM15991
Substrate/Competitorn/a
Meas. Tech.In Vitro Enzyme Assay
IC50 79.4±18 nM
Citation Lawrence, HRMartin, MPLuo, YPireddu, RYang, HGevariya, HOzcan, SZhu, JYKendig, RRodriguez, MElias, RCheng, JQSebti, SMSchonbrunn, ELawrence, NJ Development of o-chlorophenyl substituted pyrimidines as exceptionally potent aurora kinase inhibitors. J Med Chem55:7392-416 (2012) 
 
Aurora kinase A
Name:Aurora kinase A
Type:Serine/threonine-protein kinase
Mol. Mass.:45830.98
Organism:Homo sapiens (Human)
Description:O14965
Residue:403
BDBM15991
NameBDBM15991
Synonyms:2-{[2-(phenylamino)pyrimidin-4-yl]amino}benzoic acid Bisanilinopyrimidine, 3b | US9249124, 3
TypeSmall organic molecule
Emp. Form.C17H14N4O2
Mol. Mass.306.3187
SMILESOC(=O)c1ccccc1Nc1ccnc(Nc2ccccc2)n1