Reaction Details
TargetAurora kinase A
LigandBDBM16005
Substrate/Competitorn/a
Meas. Tech.In Vitro Enzyme Assay
IC50 57.6±5.4 nM
Citation Lawrence, HRMartin, MPLuo, YPireddu, RYang, HGevariya, HOzcan, SZhu, JYKendig, RRodriguez, MElias, RCheng, JQSebti, SMSchonbrunn, ELawrence, NJ Development of o-chlorophenyl substituted pyrimidines as exceptionally potent aurora kinase inhibitors. J Med Chem55:7392-416 (2012) 
 
Aurora kinase A
Name:Aurora kinase A
Type:Serine/threonine-protein kinase
Mol. Mass.:45830.98
Organism:Homo sapiens (Human)
Description:O14965
Residue:403
BDBM16005
NameBDBM16005
Synonyms:2-[(2-{[4-(morpholin-4-yl)phenyl]amino}pyrimidin-4-yl)amino]benzoic acid Bisanilinopyrimidine, 3c | US9249124, 4
TypeSmall organic molecule
Emp. Form.C21H21N5O3
Mol. Mass.391.4231
SMILESOC(=O)c1ccccc1Nc1ccnc(Nc2ccc(cc2)N2CCOCC2)n1