Reaction Details
TargetAurora kinase A
LigandBDBM87047
Substrate/Competitorn/a
Meas. Tech.In Vitro Enzyme Assay
IC50 10±1.6 nM
Citation Lawrence, HRMartin, MPLuo, YPireddu, RYang, HGevariya, HOzcan, SZhu, JYKendig, RRodriguez, MElias, RCheng, JQSebti, SMSchonbrunn, ELawrence, NJ Development of o-chlorophenyl substituted pyrimidines as exceptionally potent aurora kinase inhibitors. J Med Chem55:7392-416 (2012) 
 
Aurora kinase A
Name:Aurora kinase A
Type:Serine/threonine-protein kinase
Mol. Mass.:45830.98
Organism:Homo sapiens (Human)
Description:O14965
Residue:403
BDBM87047
NameBDBM87047
Synonyms:Bisanilinopyrimidine inhibitor, 1 US9249124, 9
TypeSmall organic molecule
Emp. Form.C17H14N4O2
Mol. Mass.306.3187
SMILESOC(=O)c1ccc(Nc2nccc(Nc3ccccc3)n2)cc1