Reaction Details
TargetAurora kinase A
LigandBDBM92809
Substrate/Competitorn/a
Meas. Tech.In Vitro Enzyme Assay
IC50 1773±142 nM
Citation Lawrence, HRMartin, MPLuo, YPireddu, RYang, HGevariya, HOzcan, SZhu, JYKendig, RRodriguez, MElias, RCheng, JQSebti, SMSchonbrunn, ELawrence, NJ Development of o-chlorophenyl substituted pyrimidines as exceptionally potent aurora kinase inhibitors. J Med Chem55:7392-416 (2012) 
 
Aurora kinase A
Name:Aurora kinase A
Type:Serine/threonine-protein kinase
Mol. Mass.:45830.98
Organism:Homo sapiens (Human)
Description:O14965
Residue:403
BDBM92809
NameBDBM92809
Synonyms:Bisanilinopyrimidine, 6b | US9249124, 25
TypeSmall molecule
Emp. Form.C17H13F3N4
Mol. Mass.330.3071
SMILESFC(F)(F)c1ccccc1Nc1ccnc(Nc2ccccc2)n1