Reaction Details
TargetAurora kinase A
LigandBDBM87051
Substrate/Competitorn/a
Meas. Tech.In Vitro Enzyme Assay
IC50 28±4.8 nM
Citation Lawrence, HRMartin, MPLuo, YPireddu, RYang, HGevariya, HOzcan, SZhu, JYKendig, RRodriguez, MElias, RCheng, JQSebti, SMSchonbrunn, ELawrence, NJ Development of o-chlorophenyl substituted pyrimidines as exceptionally potent aurora kinase inhibitors. J Med Chem55:7392-416 (2012) 
 
Aurora kinase A
Name:Aurora kinase A
Type:Serine/threonine-protein kinase
Mol. Mass.:45830.98
Organism:Homo sapiens (Human)
Description:O14965
Residue:403
BDBM87051
NameBDBM87051
Synonyms:Bisanilinopyrimidine inhibitor, 5 | Bisanilinopyrimidine, 6d
TypeSmall organic molecule
Emp. Form.C18H13F3N4O3
Mol. Mass.390.316
SMILESOC(=O)c1ccc(Nc2nccc(Nc3ccccc3OC(F)(F)F)n2)cc1