Reaction Details
TargetAurora kinase A
LigandBDBM92813
Substrate/Competitorn/a
Meas. Tech.In Vitro Enzyme Assay
IC50 46.6±8.4 nM
Citation Lawrence, HRMartin, MPLuo, YPireddu, RYang, HGevariya, HOzcan, SZhu, JYKendig, RRodriguez, MElias, RCheng, JQSebti, SMSchonbrunn, ELawrence, NJ Development of o-chlorophenyl substituted pyrimidines as exceptionally potent aurora kinase inhibitors. J Med Chem55:7392-416 (2012) 
 
Aurora kinase A
Name:Aurora kinase A
Type:Serine/threonine-protein kinase
Mol. Mass.:45830.98
Organism:Homo sapiens (Human)
Description:O14965
Residue:403
BDBM92813
NameBDBM92813
Synonyms:Bisanilinopyrimidine, 6f | US9249124, 29
TypeSmall molecule
Emp. Form.C17H16N4O
Mol. Mass.292.3351
SMILESCOc1ccccc1Nc1ccnc(Nc2ccccc2)n1