Reaction Details
TargetAurora kinase A
LigandBDBM92819
Substrate/Competitorn/a
Meas. Tech.In Vitro Enzyme Assay
IC50 284±11.3 nM
Citation Lawrence, HRMartin, MPLuo, YPireddu, RYang, HGevariya, HOzcan, SZhu, JYKendig, RRodriguez, MElias, RCheng, JQSebti, SMSchonbrunn, ELawrence, NJ Development of o-chlorophenyl substituted pyrimidines as exceptionally potent aurora kinase inhibitors. J Med Chem55:7392-416 (2012) 
 
Aurora kinase A
Name:Aurora kinase A
Type:Serine/threonine-protein kinase
Mol. Mass.:45830.98
Organism:Homo sapiens (Human)
Description:O14965
Residue:403
BDBM92819
NameBDBM92819
Synonyms:Bisanilinopyrimidine, 6l | US9249124, 35
TypeSmall molecule
Emp. Form.C16H13FN4
Mol. Mass.280.2996
SMILESFc1ccccc1Nc1ccnc(Nc2ccccc2)n1