Reaction Details
TargetAurora kinase A
LigandBDBM92820
Substrate/Competitorn/a
Meas. Tech.In Vitro Enzyme Assay
IC50 35±3.3 nM
Citation Lawrence, HRMartin, MPLuo, YPireddu, RYang, HGevariya, HOzcan, SZhu, JYKendig, RRodriguez, MElias, RCheng, JQSebti, SMSchonbrunn, ELawrence, NJ Development of o-chlorophenyl substituted pyrimidines as exceptionally potent aurora kinase inhibitors. J Med Chem55:7392-416 (2012) 
 
Aurora kinase A
Name:Aurora kinase A
Type:Serine/threonine-protein kinase
Mol. Mass.:45830.98
Organism:Homo sapiens (Human)
Description:O14965
Residue:403
BDBM92820
NameBDBM92820
Synonyms:Bisanilinopyrimidine, 6m | US9249124, 36
TypeSmall molecule
Emp. Form.C17H13IN4O2
Mol. Mass.432.2152
SMILESOC(=O)c1ccc(Nc2nccc(Nc3ccccc3I)n2)cc1