Reaction Details
TargetAurora kinase A
LigandBDBM92826
Substrate/Competitorn/a
Meas. Tech.In Vitro Enzyme Assay
IC50 50.2±2.7 nM
Citation Lawrence, HRMartin, MPLuo, YPireddu, RYang, HGevariya, HOzcan, SZhu, JYKendig, RRodriguez, MElias, RCheng, JQSebti, SMSchonbrunn, ELawrence, NJ Development of o-chlorophenyl substituted pyrimidines as exceptionally potent aurora kinase inhibitors. J Med Chem55:7392-416 (2012) 
 
Aurora kinase A
Name:Aurora kinase A
Type:Serine/threonine-protein kinase
Mol. Mass.:45830.98
Organism:Homo sapiens (Human)
Description:O14965
Residue:403
BDBM92826
NameBDBM92826
Synonyms:Bisanilinopyrimidine, 6s | US9249124, 42
TypeSmall molecule
Emp. Form.C19H17ClN4O2
Mol. Mass.368.817
SMILESCCN(c1ccnc(Nc2ccc(cc2)C(O)=O)n1)c1ccccc1Cl