Reaction Details
TargetAurora kinase A
LigandBDBM92827
Substrate/Competitorn/a
Meas. Tech.In Vitro Enzyme Assay
IC50 4.5±1.1 nM
Citation Lawrence, HRMartin, MPLuo, YPireddu, RYang, HGevariya, HOzcan, SZhu, JYKendig, RRodriguez, MElias, RCheng, JQSebti, SMSchonbrunn, ELawrence, NJ Development of o-chlorophenyl substituted pyrimidines as exceptionally potent aurora kinase inhibitors. J Med Chem55:7392-416 (2012) 
 
Aurora kinase A
Name:Aurora kinase A
Type:Serine/threonine-protein kinase
Mol. Mass.:45830.98
Organism:Homo sapiens (Human)
Description:O14965
Residue:403
BDBM92827
NameBDBM92827
Synonyms:Bisanilinopyrimidine, 6t
TypeSmall molecule
Emp. Form.C17H13FN4O2
Mol. Mass.324.3091
SMILESOC(=O)c1ccccc1Nc1nccc(Nc2ccccc2F)n1