Reaction Details
TargetAurora kinase A
LigandBDBM92828
Substrate/Competitorn/a
Meas. Tech.In Vitro Enzyme Assay
IC50 216±10.3 nM
Citation Lawrence, HRMartin, MPLuo, YPireddu, RYang, HGevariya, HOzcan, SZhu, JYKendig, RRodriguez, MElias, RCheng, JQSebti, SMSchonbrunn, ELawrence, NJ Development of o-chlorophenyl substituted pyrimidines as exceptionally potent aurora kinase inhibitors. J Med Chem55:7392-416 (2012) 
 
Aurora kinase A
Name:Aurora kinase A
Type:Serine/threonine-protein kinase
Mol. Mass.:45830.98
Organism:Homo sapiens (Human)
Description:O14965
Residue:403
BDBM92828
NameBDBM92828
Synonyms:Bisanilinopyrimidine, 9a | US9249124, 45
TypeSmall molecule
Emp. Form.C23H25ClN6O2
Mol. Mass.452.937
SMILESClc1ccccc1Nc1ccnc(Nc2ccc(cc2)C(=O)NCCN2CCOCC2)n1