Reaction Details
TargetAurora kinase B
LigandBDBM92830
Substrate/Competitorn/a
Meas. Tech.In Vitro Enzyme Assay
IC50 123±0 nM
Citation Lawrence, HRMartin, MPLuo, YPireddu, RYang, HGevariya, HOzcan, SZhu, JYKendig, RRodriguez, MElias, RCheng, JQSebti, SMSchonbrunn, ELawrence, NJ Development of o-chlorophenyl substituted pyrimidines as exceptionally potent aurora kinase inhibitors. J Med Chem55:7392-416 (2012) 
 
Aurora kinase B
Name:Aurora kinase B
Type:Protein
Mol. Mass.:39327.72
Organism:Homo sapiens (Human)
Description:Q96GD4
Residue:344
BDBM92830
NameBDBM92830
Synonyms:Bisanilinopyrimidine, 9c | US9249124, 46
TypeSmall molecule
Emp. Form.C20H20ClN5O2
Mol. Mass.397.858
SMILESCOCCNC(=O)c1ccc(Nc2nccc(Nc3ccccc3Cl)n2)cc1