Reaction Details
TargetAurora kinase B
LigandBDBM92843
Substrate/Competitorn/a
Meas. Tech.In Vitro Enzyme Assay
IC50 226±0 nM
Citation Lawrence, HRMartin, MPLuo, YPireddu, RYang, HGevariya, HOzcan, SZhu, JYKendig, RRodriguez, MElias, RCheng, JQSebti, SMSchonbrunn, ELawrence, NJ Development of o-chlorophenyl substituted pyrimidines as exceptionally potent aurora kinase inhibitors. J Med Chem55:7392-416 (2012) 
 
Aurora kinase B
Name:Aurora kinase B
Type:Protein
Mol. Mass.:39327.72
Organism:Homo sapiens (Human)
Description:Q96GD4
Residue:344
BDBM92843
NameBDBM92843
Synonyms:Bisanilinopyrimidine, 12a | US9249124, 59
TypeSmall molecule
Emp. Form.C17H13ClN8
Mol. Mass.364.792
SMILESClc1ccccc1Nc1ccnc(Nc2ccc(cc2)-c2nnn[nH]2)n1