Reaction Details
TargetAurora kinase A
LigandBDBM92845
Substrate/Competitorn/a
Meas. Tech.In Vitro Enzyme Assay
IC50 17.3±2.3 nM
Citation Lawrence, HRMartin, MPLuo, YPireddu, RYang, HGevariya, HOzcan, SZhu, JYKendig, RRodriguez, MElias, RCheng, JQSebti, SMSchonbrunn, ELawrence, NJ Development of o-chlorophenyl substituted pyrimidines as exceptionally potent aurora kinase inhibitors. J Med Chem55:7392-416 (2012) 
 
Aurora kinase A
Name:Aurora kinase A
Type:Serine/threonine-protein kinase
Mol. Mass.:45830.98
Organism:Homo sapiens (Human)
Description:O14965
Residue:403
BDBM92845
NameBDBM92845
Synonyms:Bisanilinopyrimidine, 12c | US9249124, 61
TypeSmall molecule
Emp. Form.C17H12ClFN8O
Mol. Mass.398.782
SMILESOc1cc(Nc2ncc(F)c(Nc3ccccc3Cl)n2)ccc1-c1nnn[nH]1