Reaction Details
TargetKinesin-like protein KIF11
LigandBDBM50293744
Substrate/Competitorn/a
Meas. Tech.Binding Assay
Kd 6e+2±n/a nM
Citation Sheth, PRShipps, GWSeghezzi, WSmith, CKChuang, CCSanden, DBasso, ADVilenchik, LGray, KAnnis, DANickbarg, EMa, YLahue, BHerbst, RLe, HV Novel benzimidazole inhibitors bind to a unique site in the kinesin spindle protein motor domain. Biochemistry49:8350-8 (2010) 
 
Kinesin-like protein KIF11
Name:Kinesin-like protein KIF11
Type:PROTEIN
Mol. Mass.:119138.97
Organism:Homo sapiens (Human)
Description:ChEMBL_1457426
Residue:1056
BDBM50293744
NameBDBM50293744
Synonyms:2-(4-sulfamoylphenylamino)-1-(2-(trifluoromethyl)benzyl)-1H-benzo[d]imidazole-5-carboxamide KSP Inhibitor, 4e
TypeSmall organic molecule
Emp. Form.C22H18F3N5O3S
Mol. Mass.489.47
SMILESNC(=O)c1ccc2n(Cc3ccccc3C(F)(F)F)c(Nc3ccc(cc3)S(N)(=O)=O)nc2c1