Reaction Details
TargetDihydrolipoyl dehydrogenase
LigandBDBM92887
Substrate/Competitorn/a
Meas. Tech.Enzymatic Assay
IC50>1.00e+5±n/a nM
Citation Bryk, RArango, NVenugopal, AWarren, JDPark, YHPatel, MSLima, CDNathan, C Triazaspirodimethoxybenzoyls as selective inhibitors of mycobacterial lipoamide dehydrogenase . Biochemistry49:1616-27 (2010) 
 
Dihydrolipoyl dehydrogenase
Name:Dihydrolipoyl dehydrogenase
Type:Enzyme
Mol. Mass.:49231.98
Organism:Mycobacterium tuberculosis
Description:P9WHH8
Residue:464
BDBM92887
NameBDBM92887
Synonyms:Triazaspirobenzyl, 5
TypeSmall molecule
Emp. Form.C32H34Cl2N4O5
Mol. Mass.625.542
SMILESCOc1ccc(C(=O)N2CCC3(CC2)N(CN(CC(=O)NCCc2ccc(Cl)cc2Cl)C3=O)c2ccccc2)c(OC)c1