Reaction Details
TargetNitric oxide synthase, brain
LigandBDBM50072297
Substrate/Competitorn/a
Meas. Tech.Inhibition Assay
Ki 1.7e+3±n/a nM
Citation Wang, YMonzingo, AFHu, SSchaller, THRobertus, JDFast, W Developing dual and specific inhibitors of dimethylarginine dimethylaminohydrolase-1 and nitric oxide synthase: toward a targeted polypharmacology to control nitric oxide. Biochemistry48:8624-35 (2009) 
 
Nitric oxide synthase, brain
Name:Nitric oxide synthase, brain
Type:Enzyme
Mol. Mass.:160570.98
Organism:Rattus norvegicus (rat)
Description:Recombinant nNOS overexpressed in E. coli was used in enzyme assays.
Residue:1429
BDBM50072297
NameBDBM50072297
Synonyms:(S)-5-Acetimidoylamino-2-amino-pent 5-Acetimidoylamino-2-(S)-amino-pentanoic acid L-NIO, 12 N5-IMINOETHYL-L-ORNITHINE
TypeSmall organic molecule
Emp. Form.C7H15N3O2
Mol. Mass.173.2129
SMILESCC(N)=NCCC[C@H](N)C(O)=O