Reaction Details
TargetThiamine-binding periplasmic protein
LigandBDBM92962
Substrate/Competitorn/a
Meas. Tech.Titration Assay
Kd 7.4±0.7 nM
Citation Soriano, EVRajashankar, KRHanes, JWBale, SBegley, TPEalick, SE Structural similarities between thiamin-binding protein and thiaminase-I suggest a common ancestor. Biochemistry47:1346-57 (2008) 
 
Thiamine-binding periplasmic protein
Name:Thiamine-binding periplasmic protein
Type:Protein
Mol. Mass.:36163.97
Organism:Escherichia coli (strain K12)
Description:P31550
Residue:327
BDBM92962
NameBDBM92962
Synonyms:ThDP
TypeSmall molecule
Emp. Form.C12H19N4O7P2S
Mol. Mass.425.314
SMILESCc1c(CCOP(O)(=O)OP(O)(O)=O)sc[n+]1Cc1cnc(C)nc1N