Reaction Details
TargetAmine oxidase [flavin-containing] A
LigandBDBM92963
Substrate/Competitorn/a
Meas. Tech.Inhibition Assay
Ki 1.51e+5± 4.9e+4 nM
Citation Upadhyay, AKWang, JEdmondson, DE Comparison of the structural properties of the active site cavities of human and rat monoamine oxidase A and B in their soluble and membrane-bound forms. Biochemistry47:526-36 (2008) 
 
Amine oxidase [flavin-containing] A
Name:Amine oxidase [flavin-containing] A
Type:Enzyme
Mol. Mass.:59515.21
Organism:Rattus norvegicus (rat)
Description:n/a
Residue:526
BDBM92963
NameBDBM92963
Synonyms:ParSL
TypeSmall molecule
Emp. Form.C22H32N3O2
Mol. Mass.370.5089
SMILESCN(CC#C)Cc1ccc(CC(=O)NC2CC(C)(C)N([O-])C(C)(C)C2)cc1