Reaction Details
TargetFarnesyl pyrophosphate synthase
LigandBDBM50059860
Substrate/Competitorn/a
Meas. Tech.CVLS Assay
Ki 4.7± 0.5 nM
Citation Pompliano, DLRands, ESchaber, MDMosser, SDAnthony, NJGibbs, JB Steady-state kinetic mechanism of Ras farnesyl:protein transferase. Biochemistry31:3800-7 (1992) 
 
Farnesyl pyrophosphate synthase
Name:Farnesyl pyrophosphate synthase
Type:Enzyme
Mol. Mass.:48272.89
Organism:Homo sapiens (Human)
Description:P14324
Residue:419
BDBM50059860
NameBDBM50059860
Synonyms:((2E,6E)-1-Hydroxy-3,7,11-trimethyl-dodeca-2,6,10-trienyl)-phosphonic acid Hydroxy phosphonate, 1
TypeSmall organic molecule
Emp. Form.C15H27O4P
Mol. Mass.302.3462
SMILES[#6]-[#6](-[#6]-[#6]\[#6]=[#6](/[#6])-[#6]-[#6]\[#6]=[#6](/[#6])-[#6])-[#6]-[#6](=O)P([#8])([#8])=O