Reaction Details
TargetVitamin D3 receptor
LigandBDBM93061
Substrate/Competitorn/a
Meas. Tech.VDR Binding Assay
Ki 0.2±0 nM
Citation Grzywacz, PPlum, LAClagett-Dame, MDeluca, HF 26- and 27-Methyl groups of 2-substituted, 19-nor-1a,25-dihydroxylated vitamin D compounds are essential for calcium mobilization in vivo. Bioorg Chem47:9-16 (2013) 
 
Vitamin D3 receptor
Name:Vitamin D3 receptor
Type:Protein
Mol. Mass.:48288.72
Organism:Homo sapiens (Human)
Description:P11473
Residue:427
BDBM93061
NameBDBM93061
Synonyms:Vitamin D analog, 6
TypeSmall molecule
Emp. Form.C25H40O3
Mol. Mass.388.5833
SMILES[#6]-[#6@H](-[#6]-[#6]-[#6]-[#6]-[#8])-[#6]1-[#6]-[#6]-[#6]2\[#6](-[#6]-[#6]-[#6][C@]12[#6])=[#6]\[#6]=[#6]-1\[#6]-[#6@@H](-[#8])-[#6](=[#6])-[#6@H](-[#8])-[#6]-1