Reaction Details
TargetProstaglandin G/H synthase 1 [582-599]
LigandBDBM93105
Substrate/Competitorn/a
Meas. Tech.In Vitro COX Inhibition Assay
IC50 8.59e+4± 5.8e+3 nM
Citation Zarghi, AArefi, HDadrass, OGTorabi, S Design and synthesis of new 2-aryl, 3-benzyl- (1,3-oxazolidine or 1,3-thiazolidine)-4-ones as selective cyclooxygenase (COX-2) inhibitor Med Chem Res19:782-793 (2009)  
 
Prostaglandin G/H synthase 1 [582-599]
Name:Prostaglandin G/H synthase 1 [582-599]
Type:Protein
Mol. Mass.:1879.89
Organism:Homo sapiens (Human)
Description:Q6LCE7
Residue:18
PDASQDDGPAVERPSTEL
BDBM93105
NameBDBM93105
Synonyms:COX inhibitor, 8
TypeSmall molecule
Emp. Form.C17H17NO2
Mol. Mass.267.3224
SMILESCC1OC(N(Cc2ccccc2)C1=O)c1ccccc1