Reaction Details
TargetProstaglandin G/H synthase 2
LigandBDBM93105
Substrate/Competitorn/a
Meas. Tech.In Vitro COX Inhibition Assay
IC50 2.7e+2± 2e+1 nM
Citation Zarghi, AArefi, HDadrass, OGTorabi, S Design and synthesis of new 2-aryl, 3-benzyl- (1,3-oxazolidine or 1,3-thiazolidine)-4-ones as selective cyclooxygenase (COX-2) inhibitor Med Chem Res19:782-793 (2009)  
 
Prostaglandin G/H synthase 2
Name:Prostaglandin G/H synthase 2
Type:Enzyme
Mol. Mass.:69003.89
Organism:Homo sapiens (Human)
Description:Recombinant Cox-2 provided by Cayman (Cayman Chemical Co.,Ann Arbor, MI).
Residue:604
BDBM93105
NameBDBM93105
Synonyms:COX inhibitor, 8
TypeSmall molecule
Emp. Form.C17H17NO2
Mol. Mass.267.3224
SMILESCC1OC(N(Cc2ccccc2)C1=O)c1ccccc1