Reaction Details
TargetCysteine proteinase falcipain 3
LigandBDBM93124
Substrate/Competitorn/a
Meas. Tech.In Vitro Inhibition Assay
IC50 2.94e+4±n/a nM
Citation Goud, PMSheri, ADesai, PVWatkins, EBTekwani, BSabnis, YGut, JRosenthal, PJAvery, MA Design, synthesis and evaluation of trisubstituted thiazoles targeting plasmodium falciparum cysteine proteases Medicinal Chemistry Research14:74-105 (2005)  
 
Cysteine proteinase falcipain 3
Name:Cysteine proteinase falcipain 3
Synonyms:Cysteine protease falcipain-3
Type:Protein
Mol. Mass.:56666.98
Organism:Plasmodium falciparum
Description:Q9NAW4
Residue:492
BDBM93124
NameBDBM93124
Synonyms:Trisubsituted thiazole, 14
TypeSmall molecule
Emp. Form.C27H31NO2S2
Mol. Mass.465.671
SMILESOCCCc1sc(C=CC(=O)CSCCCc2ccccc2)nc1CCc1ccccc1