Reaction Details
TargetHigh affinity nerve growth factor receptor
LigandBDBM93146
Substrate/Competitorn/a
Meas. Tech.Inhibition Assay
IC50 20±0.0 nM
Citation Raeppel, SLGaudette, FNguyen, HBeaulieu, NWang, JMaroun, CBesterman, JMVaisburg, A Identification of a Novel Series of Potent TrkA Receptor Tyrosine Kinase Inhibitors International Journal of Medicinal Chemistry2012:1-6 (2012)  
 
High affinity nerve growth factor receptor
Name:High affinity nerve growth factor receptor
Type:n/a
Mol. Mass.:87498.18
Organism:Homo sapiens (Human)
Description:P04629
Residue:796
BDBM93146
NameBDBM93146
Synonyms:2-oxoimidazolidine-1-carboxamide, 13
TypeSmall molecule
Emp. Form.C21H19N5O3
Mol. Mass.389.4073
SMILESNc1cc(Oc2ccc(NC(=O)N3CCN(C3=O)c3ccccc3)cc2)ccn1