Reaction Details
TargetHigh affinity nerve growth factor receptor
LigandBDBM93150
Substrate/Competitorn/a
Meas. Tech.Inhibition Assay
IC50 4±0.0 nM
Citation Raeppel, SLGaudette, FNguyen, HBeaulieu, NWang, JMaroun, CBesterman, JMVaisburg, A Identification of a Novel Series of Potent TrkA Receptor Tyrosine Kinase Inhibitors International Journal of Medicinal Chemistry2012:1-6 (2012)  
 
High affinity nerve growth factor receptor
Name:High affinity nerve growth factor receptor
Type:n/a
Mol. Mass.:87498.18
Organism:Homo sapiens (Human)
Description:P04629
Residue:796
BDBM93150
NameBDBM93150
Synonyms:2-oxoimidazolidine-1-carboxamide, 17
TypeSmall molecule
Emp. Form.C28H30FN7O4
Mol. Mass.547.5807
SMILESFc1ccc(cc1)N1CCN(C(=O)Nc2ccc(Oc3ccnc(NC(=O)NCCN4CCCC4)c3)cc2)C1=O