Reaction Details
TargetCathepsin K
LigandBDBM93184
Substrate/Competitorn/a
Meas. Tech.Inhibition Assay
pH5.5±0
Ki 16±0.0 nM
Citation Yamashita, DSDong, XOh, HJBrook, CSTomaszek, TASzewczuk, LTew, DGVeber, DF Solid-phase synthesis of a combinatorial array of 1,3-bis(acylamino)-2-butanones, inhibitors of the cysteine proteases cathepsins K and L. J Comb Chem1:207-15 (1999) 
 
Cathepsin K
Name:Cathepsin K
Type:Enzyme
Mol. Mass.:36975.68
Organism:Homo sapiens (Human)
Description:P43235
Residue:329
BDBM93184
NameBDBM93184
Synonyms:Cathepsin Inhibitor, Column 6 Row 2
TypeSmall molecule
Emp. Form.C35H32N4O4S
Mol. Mass.604.718
SMILESCC(NC(=O)[C@H](Cc1ccccc1)NC(=O)c1cc2ccccc2s1)C(=O)CNC(=O)Cc1cccc(c1)-c1ccccn1