Reaction Details
TargetTyrosine-protein kinase CSK
LigandBDBM93207
Substrate/Competitorn/a
Meas. Tech.Fluorescence Assay
pH7.5±0
Temperature298.15±0 K
IC50 8.4±0.2 nM
Citation Brigham, JLPerera, BGMaly, DJ A Hexylchloride-Based Catch-and-Release System for Chemical Proteomic Applications. ACS Chem Biol8:691-9 (2013) 
 
Tyrosine-protein kinase CSK
Name:Tyrosine-protein kinase CSK
Type:Tyrosine-protein kinase
Mol. Mass.:50707.30
Organism:Homo sapiens (Human)
Description:P41240
Residue:450
BDBM93207
NameBDBM93207
Synonyms:Kinase inhibitor, 5
TypeSmall molecule
Emp. Form.C31H26F3N5O2
Mol. Mass.557.5656
SMILESCc1ccc(NC(=O)c2cccc(c2)C(F)(F)F)cc1-c1ccc2nc(Nc3ccc(OCCN)cc3)ncc2c1