Reaction Details
TargetGag-Pol polyprotein
LigandBDBM93208
Substrate/Competitorn/a
Meas. Tech.Capsid Assembly Assay
IC50 6.1e+3±n/a nM
Kd 4.3e+4±n/a nM
Citation Goudreau, NLemke, CTFaucher, AMGrand-Maître, CGoulet, SLacoste, JERancourt, JMalenfant, EMercier, JFTitolo, SMason, SW Novel Inhibitor Binding Site Discovery on HIV-1 Capsid N-Terminal Domain by NMR and X-ray Crystallography. ACS Chem Biol8:1074-82 (2013) 
 
Gag-Pol polyprotein
Name:Gag-Pol polyprotein
Type:Protein
Mol. Mass.:161820.05
Organism:Human immunodeficiency virus type 1 group M subtype B (isolate NY5) (HIV-1)
Description:P12497
Residue:1435
BDBM93208
NameBDBM93208
Synonyms:Benzimidazole Inhibitor, 1
TypeSmall molecule
Emp. Form.C28H27N5O2
Mol. Mass.465.5463
SMILESCN(C)CCCn1c(nc2cc(ccc12)-c1ccc(cc1)C(O)=O)-c1c[nH]nc1-c1ccccc1