Reaction Details
TargetCasein kinase II subunit alpha
LigandBDBM93224
Substrate/Competitorn/a
Meas. Tech.Kinase Assay
IC50 1.8e+4±n/a nM
Citation Urich, RWishart, GKiczun, MRichters, ATidten-Luksch, NRauh, DSherborne, BWyatt, PGBrenk, R De novo design of protein kinase inhibitors by in silico identification of hinge region-binding fragments. ACS Chem Biol8:1044-52 (2013) 
 
Casein kinase II subunit alpha
Name:Casein kinase II subunit alpha
Type:Enzyme
Mol. Mass.:45151.12
Organism:Homo sapiens (Human)
Description:P68400
Residue:391
BDBM93224
NameBDBM93224
Synonyms:Kinase inhibitor, A1
TypeSmall molecule
Emp. Form.C14H18N4O2
Mol. Mass.274.3183
SMILESCC1CN(CC(C)O1)c1nc2ccccn2c(=O)c1N