Reaction Details
TargetMAP kinase-activated protein kinase 3
LigandBDBM93224
Substrate/Competitorn/a
Meas. Tech.Kinase Assay
IC50 2.1e+4±n/a nM
Citation Urich, RWishart, GKiczun, MRichters, ATidten-Luksch, NRauh, DSherborne, BWyatt, PGBrenk, R De novo design of protein kinase inhibitors by in silico identification of hinge region-binding fragments. ACS Chem Biol8:1044-52 (2013) 
 
MAP kinase-activated protein kinase 3
Name:MAP kinase-activated protein kinase 3
Type:Serine/threonine-protein kinase
Mol. Mass.:42991.57
Organism:Homo sapiens (Human)
Description:Recombinant MAPKAPK3 was phosphorylated by incubation with active p38alpha before assays.
Residue:382
BDBM93224
NameBDBM93224
Synonyms:Kinase inhibitor, A1
TypeSmall molecule
Emp. Form.C14H18N4O2
Mol. Mass.274.3183
SMILESCC1CN(CC(C)O1)c1nc2ccccn2c(=O)c1N