Reaction Details
TargetRibosomal protein S6 kinase alpha-3
LigandBDBM93224
Substrate/Competitorn/a
Meas. Tech.Kinase Assay
IC50 1.96e+5±n/a nM
Citation Urich, RWishart, GKiczun, MRichters, ATidten-Luksch, NRauh, DSherborne, BWyatt, PGBrenk, R De novo design of protein kinase inhibitors by in silico identification of hinge region-binding fragments. ACS Chem Biol8:1044-52 (2013) 
 
Ribosomal protein S6 kinase alpha-3
Name:Ribosomal protein S6 kinase alpha-3
Type:Serine/threonine-protein kinase
Mol. Mass.:83740.03
Organism:Homo sapiens (Human)
Description:The human RSK2 sequence differed from the Genbank entry NM_004586 at one residue, V45G. The protein was cloned and purified from baculovirus expression system.
Residue:740
BDBM93224
NameBDBM93224
Synonyms:Kinase inhibitor, A1
TypeSmall molecule
Emp. Form.C14H18N4O2
Mol. Mass.274.3183
SMILESCC1CN(CC(C)O1)c1nc2ccccn2c(=O)c1N