Reaction Details
TargetReceptor tyrosine-protein kinase erbB-4
LigandBDBM93226
Substrate/Competitorn/a
Meas. Tech.Kinase Assay
IC50 2.0e+4±n/a nM
Citation Urich, RWishart, GKiczun, MRichters, ATidten-Luksch, NRauh, DSherborne, BWyatt, PGBrenk, R De novo design of protein kinase inhibitors by in silico identification of hinge region-binding fragments. ACS Chem Biol8:1044-52 (2013) 
 
Receptor tyrosine-protein kinase erbB-4
Name:Receptor tyrosine-protein kinase erbB-4
Type:Protein
Mol. Mass.:146803.56
Organism:Homo sapiens (Human)
Description:Q15303
Residue:1308
BDBM93226
NameBDBM93226
Synonyms:Kinase inhibitor, B1
TypeSmall molecule
Emp. Form.C11H9N5
Mol. Mass.211.2227
SMILESNc1nc2cnc(cn2n1)-c1ccccc1