Reaction Details
TargetProto-oncogene tyrosine-protein kinase Src
LigandBDBM93226
Substrate/Competitorn/a
Meas. Tech.Kinase Assay
IC50 2.0e+4±n/a nM
Citation Urich, RWishart, GKiczun, MRichters, ATidten-Luksch, NRauh, DSherborne, BWyatt, PGBrenk, R De novo design of protein kinase inhibitors by in silico identification of hinge region-binding fragments. ACS Chem Biol8:1044-52 (2013) 
 
Proto-oncogene tyrosine-protein kinase Src
Name:Proto-oncogene tyrosine-protein kinase Src
Type:Tyr protein kinase
Mol. Mass.:60015.36
Organism:Gallus gallus (Chicken)
Description:P00523
Residue:533
BDBM93226
NameBDBM93226
Synonyms:Kinase inhibitor, B1
TypeSmall molecule
Emp. Form.C11H9N5
Mol. Mass.211.2227
SMILESNc1nc2cnc(cn2n1)-c1ccccc1