Reaction Details
TargetMitogen-activated protein kinase kinase kinase 7
LigandBDBM93226
Substrate/Competitorn/a
Meas. Tech.Kinase Assay
IC50 1.1e+4±n/a nM
Citation Urich, RWishart, GKiczun, MRichters, ATidten-Luksch, NRauh, DSherborne, BWyatt, PGBrenk, R De novo design of protein kinase inhibitors by in silico identification of hinge region-binding fragments. ACS Chem Biol8:1044-52 (2013) 
 
Mitogen-activated protein kinase kinase kinase 7
Name:Mitogen-activated protein kinase kinase kinase 7
Type:Protein
Mol. Mass.:67199.89
Organism:Homo sapiens (Human)
Description:O43318
Residue:606
BDBM93226
NameBDBM93226
Synonyms:Kinase inhibitor, B1
TypeSmall molecule
Emp. Form.C11H9N5
Mol. Mass.211.2227
SMILESNc1nc2cnc(cn2n1)-c1ccccc1