Reaction Details
TargetSerine/threonine-protein kinase Sgk1
LigandBDBM93227
Substrate/Competitorn/a
Meas. Tech.Kinase Assay
IC50 1.10e+5±n/a nM
Citation Urich, RWishart, GKiczun, MRichters, ATidten-Luksch, NRauh, DSherborne, BWyatt, PGBrenk, R De novo design of protein kinase inhibitors by in silico identification of hinge region-binding fragments. ACS Chem Biol8:1044-52 (2013) 
 
Serine/threonine-protein kinase Sgk1
Name:Serine/threonine-protein kinase Sgk1
Type:Other Protein Type
Mol. Mass.:48954.40
Organism:Homo sapiens (Human)
Description:Recombinant human SGK-1 enzyme produced in a baculovirus system.
Residue:431
BDBM93227
NameBDBM93227
Synonyms:Kinase inhibitor, C2
TypeSmall molecule
Emp. Form.C14H12N2O3S
Mol. Mass.288.322
SMILESCOc1ccc(cc1OC)-c1cc2c(nc[nH]c2=O)s1