Reaction Details
TargetEphrin type-B receptor 3
LigandBDBM93228
Substrate/Competitorn/a
Meas. Tech.Kinase Assay
IC50 1.58e+5±n/a nM
Citation Urich, RWishart, GKiczun, MRichters, ATidten-Luksch, NRauh, DSherborne, BWyatt, PGBrenk, R De novo design of protein kinase inhibitors by in silico identification of hinge region-binding fragments. ACS Chem Biol8:1044-52 (2013) 
 
Ephrin type-B receptor 3
Name:Ephrin type-B receptor 3
Type:Protein
Mol. Mass.:110326.17
Organism:Homo sapiens (Human)
Description:P54753
Residue:998
BDBM93228
NameBDBM93228
Synonyms:Kinase inhibitor, D1
TypeSmall molecule
Emp. Form.C11H17N5
Mol. Mass.219.2862
SMILESCC(C)(C)Nc1c([nH]c2ncnn12)C1CC1