Reaction Details
TargetHIV-1 protease
LigandBDBM93235
Substrate/Competitorn/a
Meas. Tech.Fluorometric Assay
Ki 200±0.0 nM
Citation Wannberg, JKaiser, NFVrang, LSamuelsson, BLarhed, MHallberg, A High-speed synthesis of potent C2-symmetric HIV-1 protease inhibitors by in-situ aminocarbonylations. J Comb Chem7:611-7 (2005) 
 
HIV-1 protease
Name:HIV-1 protease
Synonyms:n/a
Type:Protein
Mol. Mass.:10794.16
Organism:Human immunodeficiency virus
Description:Q9YQ34
Residue:99
BDBM93235
NameBDBM93235
Synonyms:HIV-1 Protease Inhibitor, 6f
TypeSmall molecule
Emp. Form.C46H68N6O10
Mol. Mass.865.0663
SMILESCNC(=O)[C@@H](NC(=O)[C@H](OCc1ccccc1C(=O)NC1CCCCC1)[C@H](O)[C@@H](O)[C@@H](OCc1ccccc1C(=O)NC1CCCCC1)C(=O)N[C@@H](C(C)C)C(=O)NC)C(C)C