Reaction Details
TargetHIV-1 protease
LigandBDBM93237
Substrate/Competitorn/a
Meas. Tech.Fluorometric Assay
Ki 7±0.0 nM
Citation Wannberg, JKaiser, NFVrang, LSamuelsson, BLarhed, MHallberg, A High-speed synthesis of potent C2-symmetric HIV-1 protease inhibitors by in-situ aminocarbonylations. J Comb Chem7:611-7 (2005) 
 
HIV-1 protease
Name:HIV-1 protease
Synonyms:n/a
Type:Protein
Mol. Mass.:10794.16
Organism:Human immunodeficiency virus
Description:Q9YQ34
Residue:99
BDBM93237
NameBDBM93237
Synonyms:HIV-1 Protease Inhibitor, 6h
TypeSmall molecule
Emp. Form.C46H56N6O10
Mol. Mass.852.971
SMILESCNC(=O)[C@@H](NC(=O)[C@H](OCc1ccccc1C(=O)Nc1ccccc1)[C@H](O)[C@@H](O)[C@@H](OCc1ccccc1C(=O)Nc1ccccc1)C(=O)N[C@@H](C(C)C)C(=O)NC)C(C)C