Reaction Details
TargetHIV-1 protease
LigandBDBM93238
Substrate/Competitorn/a
Meas. Tech.Fluorometric Assay
Ki 118±0.0 nM
Citation Wannberg, JKaiser, NFVrang, LSamuelsson, BLarhed, MHallberg, A High-speed synthesis of potent C2-symmetric HIV-1 protease inhibitors by in-situ aminocarbonylations. J Comb Chem7:611-7 (2005) 
 
HIV-1 protease
Name:HIV-1 protease
Synonyms:n/a
Type:Protein
Mol. Mass.:10794.16
Organism:Human immunodeficiency virus
Description:Q9YQ34
Residue:99
BDBM93238
NameBDBM93238
Synonyms:HIV-1 Protease Inhibitor, 6i
TypeSmall molecule
Emp. Form.C44H54N8O10
Mol. Mass.854.9472
SMILESCNC(=O)[C@@H](NC(=O)[C@H](OCc1ccccc1C(=O)Nc1cccnc1)[C@H](O)[C@@H](O)[C@@H](OCc1ccccc1C(=O)Nc1cccnc1)C(=O)N[C@@H](C(C)C)C(=O)NC)C(C)C