Reaction Details
TargetRho-associated protein kinase 2 [11-552]
LigandBDBM97668
Substrate/Competitorn/a
Meas. Tech.Inhibition Assay
pH7.2±0
Ki 464±0.0 nM
Citation Lampe, JWWatson, PSSlade, DJ Bridged bicyclic RHO kinase inhibitor compounds, composition and use US Patent US8476295 Publication Date 7/2/2013
 
Rho-associated protein kinase 2 [11-552]
Name:Rho-associated protein kinase 2 [11-552]
Type:Protein
Mol. Mass.:62268.16
Organism:Homo sapiens (Human)
Description:Chemicon #14-451
Residue:542
BDBM97668
NameBDBM97668
Synonyms:US8476295, 3.1.01
TypeSmall organic molecule
Emp. Form.C20H22N4
Mol. Mass.318.4155
SMILESC(N1CC2CCC1C2Nc1ccc2[nH]ncc2c1)c1ccccc1