Reaction Details
TargetTyrosine-protein kinase BTK
LigandBDBM97672
Substrate/Competitorn/a
Meas. Tech.In Vitro Inhibition Assay
pH7.4±0
IC50 0.58±0.0 nM
Citation Honigberg, LVerner, EPan, Z Inhibitors of Bruton's tyrosine kinase US Patent US8476284 Publication Date 7/2/2013
 
Tyrosine-protein kinase BTK
Name:Tyrosine-protein kinase BTK
Type:Enzyme
Mol. Mass.:76289.95
Organism:Homo sapiens (Human)
Description:Q06187
Residue:659
BDBM97672
NameBDBM97672
Synonyms:US8476284, 40 US9181263, 9 | US9278100, 9
TypeSmall organic molecule
Emp. Form.C26H26N6O2
Mol. Mass.454.5236
SMILESNc1ncnc2n(nc(-c3ccc(Oc4ccccc4)cc3)c12)[C@@H]1CC[C@@H](CC1)NC(=O)C=C