Reaction Details
TargetTyrosine-protein kinase Lyn
LigandBDBM1773
Substrate/Competitorn/a
Meas. Tech.In Vitro Inhibition Assay
pH7.4±0
Ki 14±0 nM
Citation Honigberg, LVerner, EPan, Z Inhibitors of Bruton's tyrosine kinase US Patent US8476284 Publication Date 7/2/2013
 
Tyrosine-protein kinase Lyn
Name:Tyrosine-protein kinase Lyn
Type:Protein
Mol. Mass.:58575.92
Organism:Homo sapiens (Human)
Description:P07948
Residue:512
BDBM1773
NameBDBM1773
Synonyms:US10280174, Comparative Compound 1 US8497277, 13 US9133201, 13 US9133201, 4 | US9975882, comparative compound A
Typen/a
Emp. Form.C25H24N6O2
Mol. Mass.440.4971
SMILESNc1ncnc2n(nc(-c3ccc(Oc4ccccc4)cc3)c12)C1CCCN(C1)C(=O)C=C