Reaction Details
TargetMacrophage colony-stimulating factor 1
LigandBDBM97730
Substrate/Competitorn/a
Meas. Tech.Fluorescence Polarization Competition Immunoassay
pH7.5±0
IC50 1e+1±n/a nM
Citation Illig, CRBallentine, SKChen, JDesJarlais, RLMeegalla, SKWall, MWilson, K Inhibitors of c-fms kinase US Patent US8481564 Publication Date 7/9/2013
 
Macrophage colony-stimulating factor 1
Name:Macrophage colony-stimulating factor 1
Type:Protein
Mol. Mass.:60631.84
Organism:Mus musculus (Mouse)
Description:P07141
Residue:552
BDBM97730
NameBDBM97730
Synonyms:US8481564, 6
TypeSmall organic molecule
Emp. Form.C21H24N6O4S
Mol. Mass.456.518
SMILESOCc1cc(NC(=O)c2nc(c[nH]2)C#N)c(cc1C1CNS(=O)(=O)NC1)C1=CCCCC1