Reaction Details
TargetGenome polyprotein [1027-1657]
LigandBDBM97761
Substrate/Competitorn/a
Meas. Tech.Inhibition Assay
pH7.5±n/a
Temperature310.15±n/a K
IC50 2±n/a nM
Commentsextracted
Citation Casarez, AJi, MKim, CUSheng, XCWu, Q Antiviral compounds US Patent US8476225 Publication Date 7/2/2013
 
Genome polyprotein [1027-1657]
Name:Genome polyprotein [1027-1657]
Type:n/a
Mol. Mass.:67260.74
Organism:Hepatitis C virus genotype 1a (isolate 1) (HCV)
Description:1027-1657 aa of P26664
Residue:631
BDBM97761
NameBDBM97761
Synonyms:US8476225, 22
TypeSmall organic molecule
Emp. Form.C32H45N5O10S2
Mol. Mass.723.857
SMILESCOc1ccc(cc1)S(=O)(=O)N1C[C@H](N(C1)C(=O)[C@@H](NC(=O)OC1CCCC1)C(C)(C)C)C(=O)N[C@@]1(C[C@H]1C=C)C(=O)NS(=O)(=O)C1CC1