Reaction Details
TargetMAP kinase-interacting serine/threonine-protein kinase 2
LigandBDBM98036
Substrate/Competitorn/a
Meas. Tech.In Vitro Kinase Assay
pH7.4±0
IC50 6e+1±n/a nM
Citation Austen, MBlack, PBlackaby, WDanilewicz, JLinney, ISchreiter, KSchneider, M Thienopyrimidines for pharmaceutical compositions US Patent US8486953 Publication Date 7/16/2013
 
MAP kinase-interacting serine/threonine-protein kinase 2
Name:MAP kinase-interacting serine/threonine-protein kinase 2
Type:Protein
Mol. Mass.:51870.79
Organism:Homo sapiens (Human)
Description:Q9HBH9
Residue:465
BDBM98036
NameBDBM98036
Synonyms:US8486953, 19
TypeSmall organic molecule
Emp. Form.C18H18FN3O3S
Mol. Mass.375.417
SMILESCOC(=O)c1sc2ncnc(Nc3ccc(F)cc3OC(C)C)c2c1C