Reaction Details
TargetMAP kinase-interacting serine/threonine-protein kinase 2
LigandBDBM98040
Substrate/Competitorn/a
Meas. Tech.In Vitro Kinase Assay
pH7.4±0
IC50 6±n/a nM
Citation Austen, MBlack, PBlackaby, WDanilewicz, JLinney, ISchreiter, KSchneider, M Thienopyrimidines for pharmaceutical compositions US Patent US8486953 Publication Date 7/16/2013
 
MAP kinase-interacting serine/threonine-protein kinase 2
Name:MAP kinase-interacting serine/threonine-protein kinase 2
Type:Protein
Mol. Mass.:51870.79
Organism:Homo sapiens (Human)
Description:Q9HBH9
Residue:465
BDBM98040
NameBDBM98040
Synonyms:US8486953, 53
TypeSmall organic molecule
Emp. Form.C22H28FN5O2S
Mol. Mass.445.553
SMILESCC(C)Oc1cc(F)ccc1Nc1ncnc2sc(C(=O)NCCCN(C)C)c(C)c12