Reaction Details
TargetSerine protease 1
LigandBDBM98590
Substrate/Competitorn/a
Meas. Tech.Enzyme Assay
Temperature297.15±0 K
Ki 11±0.0 nM
Citation Stuerzebecher, JSteinmetzer, TSchweinitz, A Urokinase inhibitors, production and use thereof US Patent US8476306 Publication Date 7/2/2013
 
Serine protease 1
Name:Serine protease 1
Type:Protein
Mol. Mass.:25951.67
Organism:Rattus norvegicus
Description:P00762
Residue:246
BDBM98590
NameBDBM98590
Synonyms:(2S)-3-benzyloxy-2-[[(2R)-2-(benzylsulfonylamino)-3-hydroxy-propanoyl]amino]-N-[(4-carbamimidoylphenyl)methyl]butanamide | US8476306, 6.16
TypeSmall organic molecule
Emp. Form.C29H35N5O6S
Mol. Mass.581.683
SMILESCC(OCc1ccccc1)[C@H](NC(=O)[C@@H](CO)NS(=O)(=O)Cc1ccccc1)C(=O)NCc1ccc(cc1)C(N)=N