Reaction Details
TargetMacrophage colony-stimulating factor 1 receptor
LigandBDBM98625
Substrate/Competitorn/a
Meas. Tech.Fluorescence Polarization Competition Assay
pH7.5±0
IC50 2.7±n/a nM
Citation Illig, CRChen, JMeegalia, SKWall, MJ Inhibitors of c-fms kinase US Patent US8497376 Publication Date 7/30/2013
 
Macrophage colony-stimulating factor 1 receptor
Name:Macrophage colony-stimulating factor 1 receptor
Type:Protein
Mol. Mass.:109173.45
Organism:Mus musculus (Mouse)
Description:P09581
Residue:977
BDBM98625
NameBDBM98625
Synonyms:US8497376, 6
TypeSmall organic molecule
Emp. Form.C30H38N4O4
Mol. Mass.518.6471
SMILESCOC[C@@]12CC[C@@](COC)(C[C@H](C1)c1ccc(NC(=O)c3ncc([nH]3)C#N)c(c1)C1=CCC(C)(C)CC1)O2