Reaction Details
TargetMacrophage colony-stimulating factor 1 receptor
LigandBDBM98627
Substrate/Competitorn/a
Meas. Tech.Fluorescence Polarization Competition Assay
pH7.5±0
IC50 0.42±n/a nM
Citation Illig, CRChen, JMeegalia, SKWall, MJ Inhibitors of c-fms kinase US Patent US8497376 Publication Date 7/30/2013
 
Macrophage colony-stimulating factor 1 receptor
Name:Macrophage colony-stimulating factor 1 receptor
Type:Protein
Mol. Mass.:109173.45
Organism:Mus musculus (Mouse)
Description:P09581
Residue:977
BDBM98627
NameBDBM98627
Synonyms:US8497376, 8
TypeSmall organic molecule
Emp. Form.C28H34N4O5
Mol. Mass.506.5934
SMILESCC1(C)CCC(=CC1)c1cc(ccc1NC(=O)c1nc(c[nH]1)[N+]#[C-])[C@]1(O)C[C@@]2(CO)CC[C@@](CO)(C1)O2